{"text_format":"2","workbook":"xlsx","n_sheets":18,"sheets":["Disclaimer","Introduction","Completion Instructions","FAQ","A. HTT General","B1. HTT Mortgage Assets","B2. HTT Public Sector Assets","B3. HTT Shipping Assets","erweitertes vdp-Template","extended vdp-Template","C. HTT Harmonised Glossary","D. Insert Nat Trans Templ","E. Optional ECB-ECAIs data","F1. Sustainable M data","F2. Sustainable PS data","G1. Crisis M Payment Holidays","E.g. General","E.g. Other"],"not_rendered":{"charts":0,"images":3,"macros":0,"external_links":0,"defined_names":17,"comments":0,"pivot_tables":0},"unopened":[],"bounds":{"document_bytes":16777216,"sheet_cells":100000,"run_cost":"one","rows_first":2000,"rows_last":500,"rows_between":2000,"halvings":0,"cell_chars":16384,"cell_head_chars":4096},"cells_cut":0,"cells_raw":0,"read":"whole","date_system":"1900"}

{"sheet":"Disclaimer","index":0,"n_rows":169,"n_cols":1,"rows_kept":169,"cut":false,"hidden":false,"merged":[]}
["Disclaimer - Important notices "]
[]
[]
["(i) The Product Information displayed on this Site has been uploaded by the Issuers of the relevant Products. None of the information displayed on this Site shall form the basis of any contract. Any User of this Site will be required to acknowledge that it has not relied on, or been induced to enter into any contract by, any representation or warranty."]
["(ii) The Covered Bond Label Foundation has not independently verified the Product Information displayed on this Site. Accordingly, no representation, warranty or undertaking, express or implied, is made, and no responsibility is accepted, by the Covered Bond Label Foundation as to or in relation to the accuracy or completeness or otherwise of such Product Information.\""]
["(iii) The information provided on or accessible through the Site is not intended for distribution to, or use by, any person or entity in any jurisdiction where such distribution or use would be contrary to local law, or which would subject us or any Issuer, to any authorisation, registration or other requirement within such jurisdiction. You agree not to use or export the information or materials available on or through this Site in violation of laws in your jurisdiction."]
[]
["TERMS OF USE"]
["This website www.coveredbondlabel.com (the \"Site\") is owned and operated by the Covered Bond Label Foundation (the Covered Bond Label Foundation together with its affiliates, \"we\" or \"us\") a Private Foundation (fondation privée / private stichting) registered in Belgium; whose registered office is at Rue de la Science 14 - 1040 Brussels - Belgium and registered under number 500.950.659 (RPR/RPM Brussels)."]
["The Site is intended for use as a directory of information relating to certain covered bond products (\"Products\") (the \"Product Information\") by an issuer of (\"Issuer\"), or potential investor in (\"Investor\"), such Products (an Issuer, Investor, or any other person accessing this Site, each a \"User\" or \"you\"). The Product Information is provided by each relevant Issuer, and remains at all times the sole responsibility of the relevant Issuer. We have not independently verified any Product Information, nor reviewed whether any Product for which information is available on the Site actually is a covered bond product. This Site or any label made available through it does not constitute, nor contain, any form of credit rating, any offer to sell (or the solicitation of an offer to purchase) any Product, nor does it constitute a recommendation, or investment advice (or any other type of advice) upon which reliance should be placed."]
[" These terms and conditions together with the documents referred to in them set out the terms of use (\"T&Cs\") on which (a) an Issuer; (b) Investor; or (c) any other User, may make use of the Site. Section A applies primarily to Investors, and Section B applies primarily to Issuers. The General T&Cs in Section C apply to all Users."]
["Our Acceptable Use Policy and Privacy Policy are incorporated into these T&Cs."]
[" Please read the T&Cs carefully before you start to use the Site. By clicking 'Accept' you indicate that you accept these T&Cs and that you agree to abide by them."]
["If any provision of these T&Cs shall be deemed unlawful, void or for any reason unenforceable, then that provision shall be deemed severable from these terms and shall not affect the validity and enforceability of any remaining provisions."]
[]
{"$rows_left_out":155}
{"sheet":"Introduction","index":1,"n_rows":42,"n_cols":6,"rows_kept":42,"cut":false,"hidden":false,"merged":[[5,3,5,7],[41,3,41,7],[39,3,39,7],[37,3,37,7],[35,3,35,7],[23,3,23,7],[25,3,25,7],[27,3,27,7],[29,3,29,7],[31,3,31,7],[33,3,33,7]]}
[]
[]
[]
[]
[{"$nulls":5},"Harmonised Transparency Template"]
[null,null,null,"2025  Version"]
[{"$nulls":5},"Germany"]
[{"$nulls":5},"Berlin Hyp AG"]
[{"$nulls":5},"Reporting Date: 29/04/2025"]
[{"$nulls":5},"Cut-off Date: 31/03/2025"]
{"$rows_empty":11}
[{"$nulls":5},"Index"]
[]
[null,null,null,"Worksheet A: HTT General"]
[]
{"$rows_left_out":18}
{"sheet":"Completion Instructions","index":2,"n_rows":91,"n_cols":7,"rows_kept":91,"cut":false,"hidden":false,"merged":[[25,2,26,7],[27,2,28,7],[29,2,30,7],[82,2,82,8],[81,2,81,8],[75,2,75,8]]}
[]
[]
[]
[]
[{"$nulls":5},"Completion Instructions"]
[]
[{"$nulls":5},"Please delete this tab once you have completed this file"]
[]
[null,null,"1. Every pool has one separate HTT. Issuers with more than one cover pool have to present as many separate HTTs as the number of pools."]
[null,null,"2.  All cells that include “[For completion]” and “[Mark as ND if not relevant]” needs to be completed"]
[null,null,"3. The  \"[For completion]\" or \"[Mark as ND if not relevant]\" cells could be filled with:"]
[null,null,null,"3.A Numbers: Please insert the appropriate data"]
[null,null,null,"3.B Letters: Please insert either No Data (ND)"]
[null,null,null,"(i)   ND1: Please complete the cell with ND1 when the information is not applicable for the jurisdiction "]
[null,null,null,"(ii)  ND2: Please complete the cell with ND2 when the information is not relevant for the issuer and/or CB programme at the present time"]
{"$rows_left_out":46}
{"sheet":"FAQ","index":3,"n_rows":36,"n_cols":3,"rows_kept":36,"cut":false,"hidden":false,"merged":[[0,0,0,2],[34,0,34,2]]}
["Frequently Asked Questions (FAQ)"]
["Please delete this tab once you have completed this file"]
[]
[null,null,"Harmonised Transparency Template - Frequently Asked Questions"]
["General Questions"]
["Question 1: What is the structure of the Harmonised Transparency Template (HTT)?"]
[null,"Response 1","The HTT contains 5 main worksheets (A, B1, B2, B3 and C). The first worksheet (A) includes the HTT general information. The second worksheet (B1) presents the mortgage information. The third worksheet (B2) contains the public sector information. The fourth worksheet (B3) contains shipping information.The fifth worksheet (C) represents the HTT glossary, which has a harmonised section across jurisdictionsat the top, but also a section for national specificities below. Any additional tabs (D, E, etc.), will contain the National Transparency Template (NTT) information where relevant. "]
["Question 2: Is the HTT going to replace the National Transparency Template (NTT)?"]
[null,"Response 2","The HTT is compulsory in order to be considered Covered Bond Label compliant. The NTT can be added in order to provide further information at national discretion. "]
["Question 3: What is the reporting frequency of the HTT?"]
[null,"Response 3","The reporting of the HTT is the same as the reporting of the National Transparency Template (NTT), i.e. at least quarterly. "]
["Question 4: Where should the HTT be posted?"]
[null,"Response 4","The HTT should be posted in the same location as the National Transparency Template (NTT) is currently posted, i.e. on the issuer's website. There is no common platform for the HTT."]
["Question 5: In what format the HTT should be disclosed?"]
[null,"Response 5","The HTT should be disclosed in Excel format in so far as it is possible, as already suggested by the Label Advisory Council and investors. Where issuers are currently providing the Template in both Excel and PDF formats, they are encouraged to continue to do so."]
{"$rows_left_out":22}
{"sheet":"A. HTT General","index":4,"n_rows":365,"n_cols":12,"rows_kept":365,"cut":false,"hidden":false,"merged":[]}
["A. Harmonised Transparency Template - General Information ",{"$nulls":4},"HTT 2025"]
[]
[null,"Reporting in Domestic Currency","EUR"]
[]
[null,"CONTENT OF TAB A"]
[null,"1. Basic Facts"]
[null,"2. Regulatory Summary"]
[null,"3. General Cover Pool / Covered Bond Information",null,null,null,"`"]
[null,"4. Compliance Art 14 CBD Check Table"]
[null,"5. References to Capital Requirements Regulation (CRR) 129(1)"]
[null,"6. Other relevant information"]
[]
["Field Number","1. Basic Facts"]
["G.1.1.1","Country","Germany"]
["G.1.1.2","Issuer Name","Berlin Hyp AG"]
{"$rows_left_out":351}
{"sheet":"B1. HTT Mortgage Assets","index":5,"n_rows":622,"n_cols":7,"rows_kept":622,"cut":false,"hidden":false,"merged":[]}
["B1. Harmonised Transparency Template - Mortgage Assets",{"$nulls":4},"HTT 2025"]
[]
[null,"Reporting in Domestic Currency","EUR"]
[]
[null,"CONTENT OF TAB B1"]
[null,"7. Mortgage Assets"]
[null,"7.A Residential Cover Pool"]
[null,"7.B Commercial Cover Pool"]
[]
["Field Number","7. Mortgage Assets"]
[null,"1. Property Type Information","Nominal (mn)",null,null,"% Total Mortgages"]
["M.7.1.1","Residential",6143.7493909870009,null,null,{"$f":"IF($C$15=0,\"\",IF(C12=\"[for completion]\",\"\",C12/$C$15))","v":0.33060508478024725}]
["M.7.1.2","Commercial",12439.598760088,null,null,{"$f":"IF($C$15=0,\"\",IF(C13=\"[for completion]\",\"\",C13/$C$15))","v":0.66939491521975281}]
["M.7.1.3","Other","[For completion]",null,null,{"$f":"IF($C$15=0,\"\",IF(C14=\"[for completion]\",\"\",C14/$C$15))","v":""}]
["M.7.1.4","Total",{"$f":"SUM(C12:C14)","v":18583.348151074999},null,null,{"$f":"SUM(F12:F14)","v":1}]
{"$rows_left_out":608}
{"sheet":"B2. HTT Public Sector Assets","index":6,"n_rows":179,"n_cols":7,"rows_kept":179,"cut":false,"hidden":true,"merged":[]}
["B2. Harmonised Transparency Template - Public Sector Assets",{"$nulls":4},"HTT 2025"]
[]
[null,"Reporting in Domestic Currency","[Please insert currency]"]
[]
[null,"CONTENT OF TAB B2"]
[null,"8. Public Sector Assets"]
[]
["Field Number","8. Public Sector Assets"]
[null,"1. General Information"]
["PS.8.1.1","Number of public sector exposures","[For completion]"]
["OPS.8.1.1","Optional information eg, Number of borrowers"]
["OPS.8.1.2","Optional information eg, Number of guarantors"]
["OPS.8.1.3"]
["OPS.8.1.4"]
["OPS.8.1.5"]
{"$rows_left_out":165}
{"sheet":"B3. HTT Shipping Assets","index":7,"n_rows":257,"n_cols":7,"rows_kept":257,"cut":false,"hidden":true,"merged":[]}
["B3. Harmonised Transparency Template - Shipping Assets",{"$nulls":4},"HTT 2025"]
[]
[null,"Reporting in Domestic Currency","[Please insert currency]"]
[]
[null,"CONTENT OF TAB B3"]
[null,"9. Shipping Assets"]
[]
["Field Number","9. Shipping Assets"]
[null,"1. General Information","Shipping Loans"]
["S.9.1.1","Number of shipping loans","[For completion]"]
["OS.9.1.1","Optional information eg, Number of borrowers"]
["OS.9.1.2","Optional information eg, Number of guarantors"]
["OS.9.1.3"]
["OS.9.1.4"]
["OS.9.1.5"]
{"$rows_left_out":243}
{"sheet":"erweitertes vdp-Template","index":8,"n_rows":41,"n_cols":8,"rows_kept":41,"cut":false,"hidden":false,"merged":[[11,3,11,5],[13,3,13,5],[14,3,14,5],[15,3,15,5],[2,3,2,5],[3,3,3,5],[4,3,4,5],[5,3,5,5],[6,3,6,5],[8,3,8,5]]}
["Hypothekenpfandbriefe","Q 1 2025"]
["Deckungsmasse (nom.)","(Mio. €)",20003.648150969999,"Umlaufende Pfandbriefe (nom).",null,null,"(Mio. €)",19064.197084089999]
["WAL der Deckungsmasse (Total)","Jahre",3.6,"WAL der ausstehenden Pfandbriefe (Total)",null,null,"Jahre",4.8]
["Anteil von \"insured mortgages\"","%",100,"Besteht die Möglichkeit einer Fälligkeitsverschiebung?",null,null,"Ja/Nein","Ja"]
["Sind Versicherungen Bestandteil der Deckungsmasse?",null,"Ja","Maximal mögliche Verschiebung?",null,null,"Monate",12]
["Sind garantierte Kredite in Deckungsmasse enthalten?","Ja/Nein","Nicht anwendbar*","Ist Fälligkeitsverschiebung gesetzlich geregelt?",null,null,"Ja/Nein","Ja"]
["Anteil garantierter Kredite ","%","Nicht anwendbar*","Sind Pass through Strukturen enthalten?",null,null,"Ja/Nein","Nicht anwendbar*"]
["Gesetzliche Überdeckung (nennwertig + barwertig nach Stressszenarien)","%","2 % + 2 %"]
["Sind \"self certified loans\" Bestandteil der Deckungsmasse?","Ja/Nein","Nicht anwendbar*","Gesamtkreditbetrag der 10 größten Kreditnehmer",null,null,"(Mio. €)",3471.13454968]
["Sind \"limited certified loans\" Bestandteil der Deckungsmasse?","Ja/Nein","Nicht anwendbar*"]
["Anteil von \"non first lien mortgages\" ","% ","Nicht anwendbar*",null,null," ","Residential","Commercial"]
["Sind ABS Bestandteil der Deckungsmasse?","Ja/Nein","Nicht anwendbar*","Anzahl der Kreditnehmer",null,null,510,668]
["\"interest only loans\"","(Mio. €)",11792.05166884,"Anzahl der Kredite ",null,null,582,722]
["Notenbankfähige Wertpapiere","(Mio. €) ",1320.3,"Anzahl der Objekte",null,null,2770,1645]
["Aufteilung der Forderungen gegenüber Zentralbanken und Kreditinstituten i.S. d. § 28 Abs. 1 Nr. 8 nach Bonitätsstufe",null,null,"Selbstgenutzte Wohnungen in der Deckungsmasse (Mio. €)",null,null,3.2490751389999999]
{"$rows_left_out":27}
{"sheet":"extended vdp-Template","index":9,"n_rows":41,"n_cols":8,"rows_kept":41,"cut":false,"hidden":false,"merged":[[11,3,11,5],[13,3,13,5],[14,3,14,5],[15,3,15,5],[2,3,2,5],[3,3,3,5],[4,3,4,5],[5,3,5,5],[6,3,6,5],[8,3,8,5]]}
["Mortgage Pfandbriefe","Q 1 2025"]
["Cover pool (nom.)","(mn. €)",20003.648150969999,"Pfandbriefe outstanding (nom).",null,null,"(mn. €)",19064.197084089999]
["Weighted Average Life (WAL) of cover pool (Total)","Years",3.6,"WAL of outstanding Pfandbriefe (Total)",null,null,"Years",4.8]
["Share of \"insured mortgages\"","%",100,"Is there a possibility of maturity extension?",null,null,"Yes/No","Yes"]
["Are insurances part of the cover pool register?",null,"Yes","Maximum potential maturity extension period?",null,null,"Months",12]
["Are guaranteed loans included in the cover pool?","Yes/No","Not applicable*","Is maturity extension regulated by law?",null,null,"Yes/No","Yes"]
["Share of guaranteed loans","%","Not applicable*","Are pass-through structures included?",null,null,"Yes/No","Not applicable*"]
["Legal overcollateralisation (nominal + npv based on stress scenarios)","%","2 % + 2 %"]
["Are self certified loans part of the cover pool?","Yes/No","Not applicable*","Total amount lent to 10 lagest borrowers",null,null,"(mn. €)",3471.13454968]
["Are limited certified loans part of the cover pool?","Yes/No","Not applicable*"]
["Percentage of non first lien mortgages","% ","Not applicable*",null,null," ","Residential","Commercial"]
["Are ABS part of the cover pool?","Yes/No","Not applicable*","Number of borrowers",null,null,510,668]
["\"interest only loans\"","(mn. €)",11792.05166884,"Number of loans",null,null,582,722]
["Central bank eligible securities","(mn. €) ",1320.3,"Number of properties",null,null,2770,1645]
["Breakdown of exposures to central banks and credit institutions within the meaning of sec. 28(1) no.8 by credit quality step",null,null,"Owner-occupied dwellings in the cover pool (mn. €)",null,null,3.2490751389999999]
{"$rows_left_out":27}
{"sheet":"C. HTT Harmonised Glossary","index":10,"n_rows":57,"n_cols":3,"rows_kept":57,"cut":false,"hidden":false,"merged":[]}
["C. Harmonised Transparency Template - Glossary",null,"HTT 2025"]
[]
["The definitions below reflect the national specificities"]
[]
["Field Number","1. Glossary - Standard Harmonised Items","Definition"]
["HG.1.1","OC Calculation: Statutory","Statutory Overcollateralisation is the overcollateralisation percentage required to be provided by each Issuer and included/disclosed in the national covered bond framework. "]
["HG.1.2","OC Calculation: Contractual","Contractual Overcollateralisation is the overcollateralisation percentage each Issuer has contractually agreed to maintain pursuant to the covered bond programme documents. "]
["HG.1.3","OC Calculation: Voluntary","Voluntary Overcollateralisation is the difference (if positive) between the actual overcollateralisation provided by an Issuer and the higher of the contractual and statutory overcollateralisation."]
["HG.1.4","Interest Rate Types","[For completion]"]
["HG.1.5","Residual Life Buckets of Cover assets [i.e. how is the contractual and/or expected residual life defined? What assumptions eg, in terms of prepayments? etc.]","[For completion]"]
["HG.1.6","Maturity Buckets of Covered Bonds [i.e. how is the contractual and/or expected maturity defined? What maturity structure (hard bullet, soft bullet, conditional pass through)? Under what conditions/circumstances? Etc.] ","[For completion]"]
["HG.1.7","Maturity Extention Triggers","[insert link to the national legislation where the maturity extention triggers are listed - insert link of relevant programme prospectus]"]
["HG.1.8","LTVs: Definition","[For completion]"]
["HG.1.9","LTVs: Calculation of property/shipping value","[For completion]"]
["HG.1.10","LTVs: Applied property/shipping valuation techniques, including whether use of index, Automated Valuation Model (AVM) or on-site audits","[For completion]"]
{"$rows_left_out":43}
{"sheet":"D. Insert Nat Trans Templ","index":11,"n_rows":0,"n_cols":0,"rows_kept":0,"cut":false,"hidden":false,"merged":[]}

{"sheet":"E. Optional ECB-ECAIs data","index":12,"n_rows":90,"n_cols":7,"rows_kept":90,"cut":false,"hidden":false,"merged":[[0,0,0,1]]}
["This addendum is optional"]
["E. Harmonised Transparency Template - Optional ECB - ECAIs Data Disclosure",{"$nulls":4},"HTT 2025"]
[]
[null,"Reporting in Domestic Currency","EUR"]
[]
[null,"CONTENT OF TAB E"]
[null,"1. Additional information on the programme"]
[null,"2.  Additional information on the swaps"]
[null,"3.  Additional information on the asset distribution"]
[]
[]
["Field Number","1.  Additional information on the programme"]
[null,"Transaction Counterparties","Name","Legal Entity Identifier (LEI)*"]
["E.1.1.1","Sponsor (if applicable)","ND1","ND1"]
["E.1.1.2","Servicer ","ND1","ND1"]
{"$rows_left_out":76}
{"sheet":"F1. Sustainable M data","index":13,"n_rows":639,"n_cols":7,"rows_kept":639,"cut":false,"hidden":false,"merged":[[23,1,23,2],[4,1,4,2],[5,1,5,2],[6,1,6,2],[7,1,7,2],[8,1,8,2],[12,1,12,2]]}
["F1. Harmonised Transparency Template - Sustainable Mortgage Data",{"$nulls":4},"HTT 2025"]
[]
[null,"Reporting in Domestic Currency","[Please insert currency]"]
[]
[null,"CONTENT OF TAB F1"]
[null,"1.  Share of sustainable loans in the total mortgage program"]
[null,"2. Additional information on the sustainable section of the mortgage stock"]
[null,"2A. Sustainable Residential Cover Pool"]
[null,"2B. Sustainable Commercial Cover Pool"]
[]
[]
[]
[null,"1.  Share of sustainable loans in the total mortgage program"]
[null,"1. Amount of sustainable loans ","Nominal (mn)","Number of loans",null,"% Nominal (mn) to total mortgage program","% No. of Loans to total mortgage program"]
["SM.1.1.1","EE mortgage loans",7029.4585019710003,422,null,{"$f":"IF(OR('B1. HTT Mortgage Assets'!$C$15=0,C15=\"[For completion]\"),\"\",C15/'B1. HTT Mortgage Assets'!$C$15)","v":0.37826652360082724},{"$f":"IF(OR('B1. HTT Mortgage Assets'!$F$28=0,D15=\"[For completion]\"),\"\",D15/'B1. HTT Mortgage Assets'!$F$28)","v":0.32361963190184051}]
{"$rows_left_out":625}
{"sheet":"F2. Sustainable PS data","index":14,"n_rows":219,"n_cols":7,"rows_kept":219,"cut":false,"hidden":true,"merged":[[8,1,8,2]]}
["F2. Harmonised Transparency Template - Sustainable Public Sector Assets",{"$nulls":4},"HTT 2025"]
[]
[null,"Reporting in Domestic Currency","[Please insert currency]"]
[]
[null,"CONTENT OF TAB F2"]
[null,"1. Share of sustainable Public Sector Assets"]
[null,"2. Sustainable Public Sector Assets"]
[]
[null,"1.  Share of sustainable public sector assets in the total cover pool program"]
[null,"1. Amount of sustainable loans ","Nominal (mn)","Number of loans",null,"% Nominal (mn) to total Public Sector program","% No. of Loans to total Public Sector program"]
["SPS.1.1.1","Green  Public Sector exposures","[For completion]","[For completion]",null,{"$f":"IF(OR('B2. HTT Public Sector Assets'!$C$37=0,C11=\"[For completion]\"),\"\",C11/'B2. HTT Public Sector Assets'!$C$37)","v":""},{"$f":"IF(OR('B2. HTT Public Sector Assets'!$C$10=0,D11=\"[For completion]\"),\"\",D11/'B2. HTT Public Sector Assets'!$C$10)","v":""}]
["SPS.1.1.2","o/w Local Communities","[For completion]","[For completion]"]
["SPS.1.1.3","o/w Hospitals","[For completion]","[For completion]"]
["SPS.1.1.4","o/w Export Credit","[For completion]","[For completion]"]
[null,"o/w other","[For completion]","[For completion]"]
{"$rows_left_out":205}
{"sheet":"G1. Crisis M Payment Holidays","index":15,"n_rows":32,"n_cols":8,"rows_kept":32,"cut":false,"hidden":false,"merged":[[12,4,12,5],[12,6,12,7],[14,1,14,3],[19,1,19,3],[0,0,0,1],[4,4,4,5],[6,1,6,2],[6,4,6,7],[7,1,7,2],[7,4,11,7],[8,1,8,2],[9,1,9,2],[10,1,10,2]]}
["This addendum is optional"]
["G1. Crisis Mortgage Payment Holidays",{"$nulls":4},"HTT 2025"]
[]
[]
[null,"Reporting in Domestic Currency","[Please insert currency]",null,"For further information concerning the nation-specific dispositions regarging the impact of the Covid 19 outbreak on cover pools, please refer to the:",null,"COVID-19: EMF-ECBC Response"]
[{"$nulls":4},"https://hypo.org/emf/market-initiative/covid-19-emf-ecbc-response/","https://hypo.org/emf/market-initiative/covid-19-emf-ecbc-response/"]
[null,"CONTENT OF Temporary Tab",null,null,"Optional further information at issuer/country level"]
[null,"1.  Share of assets affected by payment holidays caused by COVID 19",null,null,"[For completion]"]
[null,"2. Additional information on the cover pool section affected by payment holidays"]
[]
[]
[]
[{"$nulls":4},"Can the COVID-19 related payment holiday loans remain part of the cover pool?     ",null,"[YES/NO] (cancel what is not relevant)"]
[]
[null,"1.  Share of cover assets affected at the time of reporting by payment holidays caused exclusively by COVID 19"]
{"$rows_left_out":18}
{"sheet":"E.g. General","index":16,"n_rows":0,"n_cols":0,"rows_kept":0,"cut":false,"hidden":false,"merged":[]}

{"sheet":"E.g. Other","index":17,"n_rows":0,"n_cols":0,"rows_kept":0,"cut":false,"hidden":false,"merged":[]}